{"text_format":"1","workbook":"xlsx","n_sheets":4,"sheets":["活動記録","【選択肢】","【取組番号早見表】","【活動項目番号表】 "],"not_rendered":{"charts":0,"images":0,"macros":1,"external_links":0,"defined_names":30,"comments":0,"pivot_tables":0},"unopened":[],"bounds":{"document_bytes":16777216,"sheet_cells":100000,"rows_first":2000,"rows_last":500,"rows_between":2000,"halvings":0,"cell_chars":16384,"cell_head_chars":4096},"cells_cut":0,"cells_raw":0,"read":"whole","date_system":"1900"}

{"sheet":"活動記録","index":0,"n_rows":28,"n_cols":18,"rows_kept":28,"cut":false,"hidden":false,"merged":[[27,1,27,2],[1,6,1,14],[3,1,3,15],[4,1,4,2],[4,3,4,5],[4,6,6,11],[4,12,4,14],[4,15,6,15],[4,16,4,17],[5,1,6,1],[5,3,6,3],[5,4,6,4],[5,5,6,5],[5,12,6,12],[5,13,6,13],[5,14,6,14],[5,16,6,16],[5,17,6,17],[5,2,6,2],[29,15,31,15],[35,1,37,1],[35,14,37,14],[35,15,37,15],[32,1,34,1],[32,14,34,14],[32,15,34,15],[29,14,31,14],[38,1,40,1],[38,14,40,14],[38,15,40,15],[41,1,43,1],[41,14,43,14],[41,15,43,15],[53,1,55,1],[53,14,55,14],[53,15,55,15],[44,1,46,1],[44,14,46,14],[44,15,46,15],[47,1,49,1],[47,14,49,14],[47,15,49,15],[50,1,52,1],[50,14,52,14],[50,15,52,15],[56,1,58,1],[56,14,58,14],[56,15,58,15],[65,1,67,1],[65,14,67,14],[65,15,67,15],[59,1,61,1],[59,14,61,14],[59,15,61,15],[62,1,64,1],[62,14,64,14],[62,15,64,15]]}
["（様式第１－６号）","（様式第１－６号）",null,null,null,null,null,null,null,null,null,null,null,null,null,"組織名："]
[null,null,null,null,null,null,"年度　多面的機能支払交付金　活動記録"]
[null,"★「実施時間」には休憩時間を含めず、実働時間を記入してください。"]
[null,"★「活動項目番号」欄には、実施要領別記1-2の国が定める活動指針における活動項目の番号及び要領第1の２の(1)に基づき都道府県が定める要綱基本方針において追加された活動項目の番号を記入します。その他、事務処理は200番、会議等は300番を記入します。\n　同一日に複数の活動を行った場合は、該当する全ての活動項目番号を左詰めで一行に記入してください。番号欄が足りない場合は、複数行に分けて記入してください。\n　　"]
[null,"活動実施日及び活動時間",null,"活動参加人数",null,null,"活動項目番号（左詰め）",null,null,null,null,null,"活動内容",null,null,"備考（具体的な活動内容を記入）","様式欄外（参考）"]
[null,"日付","活動時間","農業者","農業者\n以外","総参加\n人数",null,null,null,null,null,null,"支払区分","活動区分","活動項目",null,"直営施工した場合は○","活動支援班による活動の場合は○"]
[]
[null,null,null,null,null,{"$f":"SUM(D8:E8)","v":0},0,null,null,null,null,null,{"$f":"IF(G8=\"\",\"\",(IFERROR(VLOOKUP($G8,【選択肢】!$Q$3:$U$90,2,),\" \")&IF(H8=\"\",\"\",\",\"&IFERROR(VLOOKUP($H8,【選択肢】!$Q$3:$U$90,2,),\" \")&IF(I8=\"\",\"\",\",\"&IFERROR(VLOOKUP($I8,【選択肢】!$Q$3:$U$90,2,),\" \")&IF(J8=\"\",\"\",\",\"&IFERROR(VLOOKUP($J8,【選択肢】!$Q$3:$U$90,2,),\" \")&IF(K8=\"\",\"\",\",\"&IFERROR(VLOOKUP($K8,【選択肢】!$Q$3:$U$90,2,),\" \")&IF(L8=\"\",\"\",\",\"&IFERROR(VLOOKUP($L8,【選択肢】!$Q$3:$U$90,2,),\" \"))))))))","v":" "},{"$f":"IF(G8=\"\",\"\",(IFERROR(VLOOKUP($G8,【選択肢】!$Q$3:$U$90,4,),\" \")&IF(H8=\"\",\"\",\",\"&IFERROR(VLOOKUP($H8,【選択肢】!$Q$3:$U$90,4,),\" \")&IF(I8=\"\",\"\",\",\"&IFERROR(VLOOKUP($I8,【選択肢】!$Q$3:$U$90,4,),\" \")&IF(J8=\"\",\"\",\",\"&IFERROR(VLOOKUP($J8,【選択肢】!$Q$3:$U$90,4,),\" \")&IF(K8=\"\",\"\",\",\"&IFERROR(VLOOKUP($K8,【選択肢】!$Q$3:$U$90,4,),\" \")&IF(L8=\"\",\"\",\",\"&IFERROR(VLOOKUP($L8,【選択肢】!$Q$3:$U$90,4,),\" \"))))))))","v":" "},{"$f":"IF(G8=\"\",\"\",(IFERROR(VLOOKUP($G8,【選択肢】!$Q$3:$U$90,5,),\" \")&IF(H8=\"\",\"\",\",\"&IFERROR(VLOOKUP($H8,【選択肢】!$Q$3:$U$90,5,),\" \")&IF(I8=\"\",\"\",\",\"&IFERROR(VLOOKUP($I8,【選択肢】!$Q$3:$U$90,5,),\" \")&IF(J8=\"\",\"\",\",\"&IFERROR(VLOOKUP($J8,【選択肢】!$Q$3:$U$90,5,),\" \")&IF(K8=\"\",\"\",\",\"&IFERROR(VLOOKUP($K8,【選択肢】!$Q$3:$U$90,5,),\" \")&IF(L8=\"\",\"\",\",\"&IFERROR(VLOOKUP($L8,【選択肢】!$Q$3:$U$90,5,),\" \"))))))))","v":" "}]
[null,null,null,null,null,{"$f":"SUM(D9:E9)","v":0},null,null,null,null,null,null,{"$f":"IF(G9=\"\",\"\",(IFERROR(VLOOKUP($G9,【選択肢】!$Q$3:$U$90,2,),\" \")&IF(H9=\"\",\"\",\",\"&IFERROR(VLOOKUP($H9,【選択肢】!$Q$3:$U$90,2,),\" \")&IF(I9=\"\",\"\",\",\"&IFERROR(VLOOKUP($I9,【選択肢】!$Q$3:$U$90,2,),\" \")&IF(J9=\"\",\"\",\",\"&IFERROR(VLOOKUP($J9,【選択肢】!$Q$3:$U$90,2,),\" \")&IF(K9=\"\",\"\",\",\"&IFERROR(VLOOKUP($K9,【選択肢】!$Q$3:$U$90,2,),\" \")&IF(L9=\"\",\"\",\",\"&IFERROR(VLOOKUP($L9,【選択肢】!$Q$3:$U$90,2,),\" \"))))))))","v":""},{"$f":"IF(G9=\"\",\"\",(IFERROR(VLOOKUP($G9,【選択肢】!$Q$3:$U$90,4,),\" \")&IF(H9=\"\",\"\",\",\"&IFERROR(VLOOKUP($H9,【選択肢】!$Q$3:$U$90,4,),\" \")&IF(I9=\"\",\"\",\",\"&IFERROR(VLOOKUP($I9,【選択肢】!$Q$3:$U$90,4,),\" \")&IF(J9=\"\",\"\",\",\"&IFERROR(VLOOKUP($J9,【選択肢】!$Q$3:$U$90,4,),\" \")&IF(K9=\"\",\"\",\",\"&IFERROR(VLOOKUP($K9,【選択肢】!$Q$3:$U$90,4,),\" \")&IF(L9=\"\",\"\",\",\"&IFERROR(VLOOKUP($L9,【選択肢】!$Q$3:$U$90,4,),\" \"))))))))","v":""},{"$f":"IF(G9=\"\",\"\",(IFERROR(VLOOKUP($G9,【選択肢】!$Q$3:$U$90,5,),\" \")&IF(H9=\"\",\"\",\",\"&IFERROR(VLOOKUP($H9,【選択肢】!$Q$3:$U$90,5,),\" \")&IF(I9=\"\",\"\",\",\"&IFERROR(VLOOKUP($I9,【選択肢】!$Q$3:$U$90,5,),\" \")&IF(J9=\"\",\"\",\",\"&IFERROR(VLOOKUP($J9,【選択肢】!$Q$3:$U$90,5,),\" \")&IF(K9=\"\",\"\",\",\"&IFERROR(VLOOKUP($K9,【選択肢】!$Q$3:$U$90,5,),\" \")&IF(L9=\"\",\"\",\",\"&IFERROR(VLOOKUP($L9,【選択肢】!$Q$3:$U$90,5,),\" \"))))))))","v":""}]
[null,null,null,null,null,0,null,null,null,null,null,null,{"$f":"IF(G10=\"\",\"\",(IFERROR(VLOOKUP($G10,【選択肢】!$Q$3:$U$90,2,),\" \")&IF(H10=\"\",\"\",\",\"&IFERROR(VLOOKUP($H10,【選択肢】!$Q$3:$U$90,2,),\" \")&IF(I10=\"\",\"\",\",\"&IFERROR(VLOOKUP($I10,【選択肢】!$Q$3:$U$90,2,),\" \")&IF(J10=\"\",\"\",\",\"&IFERROR(VLOOKUP($J10,【選択肢】!$Q$3:$U$90,2,),\" \")&IF(K10=\"\",\"\",\",\"&IFERROR(VLOOKUP($K10,【選択肢】!$Q$3:$U$90,2,),\" \")&IF(L10=\"\",\"\",\",\"&IFERROR(VLOOKUP($L10,【選択肢】!$Q$3:$U$90,2,),\" \"))))))))","v":""},{"$f":"IF(G10=\"\",\"\",(IFERROR(VLOOKUP($G10,【選択肢】!$Q$3:$U$90,4,),\" \")&IF(H10=\"\",\"\",\",\"&IFERROR(VLOOKUP($H10,【選択肢】!$Q$3:$U$90,4,),\" \")&IF(I10=\"\",\"\",\",\"&IFERROR(VLOOKUP($I10,【選択肢】!$Q$3:$U$90,4,),\" \")&IF(J10=\"\",\"\",\",\"&IFERROR(VLOOKUP($J10,【選択肢】!$Q$3:$U$90,4,),\" \")&IF(K10=\"\",\"\",\",\"&IFERROR(VLOOKUP($K10,【選択肢】!$Q$3:$U$90,4,),\" \")&IF(L10=\"\",\"\",\",\"&IFERROR(VLOOKUP($L10,【選択肢】!$Q$3:$U$90,4,),\" \"))))))))","v":""},{"$f":"IF(G10=\"\",\"\",(IFERROR(VLOOKUP($G10,【選択肢】!$Q$3:$U$90,5,),\" \")&IF(H10=\"\",\"\",\",\"&IFERROR(VLOOKUP($H10,【選択肢】!$Q$3:$U$90,5,),\" \")&IF(I10=\"\",\"\",\",\"&IFERROR(VLOOKUP($I10,【選択肢】!$Q$3:$U$90,5,),\" \")&IF(J10=\"\",\"\",\",\"&IFERROR(VLOOKUP($J10,【選択肢】!$Q$3:$U$90,5,),\" \")&IF(K10=\"\",\"\",\",\"&IFERROR(VLOOKUP($K10,【選択肢】!$Q$3:$U$90,5,),\" \")&IF(L10=\"\",\"\",\",\"&IFERROR(VLOOKUP($L10,【選択肢】!$Q$3:$U$90,5,),\" \"))))))))","v":""}]
[null,null,null,null,null,0,null,null,null,null,null,null,{"$f":"IF(G11=\"\",\"\",(IFERROR(VLOOKUP($G11,【選択肢】!$Q$3:$U$90,2,),\" \")&IF(H11=\"\",\"\",\",\"&IFERROR(VLOOKUP($H11,【選択肢】!$Q$3:$U$90,2,),\" \")&IF(I11=\"\",\"\",\",\"&IFERROR(VLOOKUP($I11,【選択肢】!$Q$3:$U$90,2,),\" \")&IF(J11=\"\",\"\",\",\"&IFERROR(VLOOKUP($J11,【選択肢】!$Q$3:$U$90,2,),\" \")&IF(K11=\"\",\"\",\",\"&IFERROR(VLOOKUP($K11,【選択肢】!$Q$3:$U$90,2,),\" \")&IF(L11=\"\",\"\",\",\"&IFERROR(VLOOKUP($L11,【選択肢】!$Q$3:$U$90,2,),\" \"))))))))","v":""},{"$f":"IF(G11=\"\",\"\",(IFERROR(VLOOKUP($G11,【選択肢】!$Q$3:$U$90,4,),\" \")&IF(H11=\"\",\"\",\",\"&IFERROR(VLOOKUP($H11,【選択肢】!$Q$3:$U$90,4,),\" \")&IF(I11=\"\",\"\",\",\"&IFERROR(VLOOKUP($I11,【選択肢】!$Q$3:$U$90,4,),\" \")&IF(J11=\"\",\"\",\",\"&IFERROR(VLOOKUP($J11,【選択肢】!$Q$3:$U$90,4,),\" \")&IF(K11=\"\",\"\",\",\"&IFERROR(VLOOKUP($K11,【選択肢】!$Q$3:$U$90,4,),\" \")&IF(L11=\"\",\"\",\",\"&IFERROR(VLOOKUP($L11,【選択肢】!$Q$3:$U$90,4,),\" \"))))))))","v":""},{"$f":"IF(G11=\"\",\"\",(IFERROR(VLOOKUP($G11,【選択肢】!$Q$3:$U$90,5,),\" \")&IF(H11=\"\",\"\",\",\"&IFERROR(VLOOKUP($H11,【選択肢】!$Q$3:$U$90,5,),\" \")&IF(I11=\"\",\"\",\",\"&IFERROR(VLOOKUP($I11,【選択肢】!$Q$3:$U$90,5,),\" \")&IF(J11=\"\",\"\",\",\"&IFERROR(VLOOKUP($J11,【選択肢】!$Q$3:$U$90,5,),\" \")&IF(K11=\"\",\"\",\",\"&IFERROR(VLOOKUP($K11,【選択肢】!$Q$3:$U$90,5,),\" \")&IF(L11=\"\",\"\",\",\"&IFERROR(VLOOKUP($L11,【選択肢】!$Q$3:$U$90,5,),\" \"))))))))","v":""}]
[null,null,null,null,null,0,null,null,null,null,null,null,{"$f":"IF(G12=\"\",\"\",(IFERROR(VLOOKUP($G12,【選択肢】!$Q$3:$U$90,2,),\" \")&IF(H12=\"\",\"\",\",\"&IFERROR(VLOOKUP($H12,【選択肢】!$Q$3:$U$90,2,),\" \")&IF(I12=\"\",\"\",\",\"&IFERROR(VLOOKUP($I12,【選択肢】!$Q$3:$U$90,2,),\" \")&IF(J12=\"\",\"\",\",\"&IFERROR(VLOOKUP($J12,【選択肢】!$Q$3:$U$90,2,),\" \")&IF(K12=\"\",\"\",\",\"&IFERROR(VLOOKUP($K12,【選択肢】!$Q$3:$U$90,2,),\" \")&IF(L12=\"\",\"\",\",\"&IFERROR(VLOOKUP($L12,【選択肢】!$Q$3:$U$90,2,),\" \"))))))))","v":""},{"$f":"IF(G12=\"\",\"\",(IFERROR(VLOOKUP($G12,【選択肢】!$Q$3:$U$90,4,),\" \")&IF(H12=\"\",\"\",\",\"&IFERROR(VLOOKUP($H12,【選択肢】!$Q$3:$U$90,4,),\" \")&IF(I12=\"\",\"\",\",\"&IFERROR(VLOOKUP($I12,【選択肢】!$Q$3:$U$90,4,),\" \")&IF(J12=\"\",\"\",\",\"&IFERROR(VLOOKUP($J12,【選択肢】!$Q$3:$U$90,4,),\" \")&IF(K12=\"\",\"\",\",\"&IFERROR(VLOOKUP($K12,【選択肢】!$Q$3:$U$90,4,),\" \")&IF(L12=\"\",\"\",\",\"&IFERROR(VLOOKUP($L12,【選択肢】!$Q$3:$U$90,4,),\" \"))))))))","v":""},{"$f":"IF(G12=\"\",\"\",(IFERROR(VLOOKUP($G12,【選択肢】!$Q$3:$U$90,5,),\" \")&IF(H12=\"\",\"\",\",\"&IFERROR(VLOOKUP($H12,【選択肢】!$Q$3:$U$90,5,),\" \")&IF(I12=\"\",\"\",\",\"&IFERROR(VLOOKUP($I12,【選択肢】!$Q$3:$U$90,5,),\" \")&IF(J12=\"\",\"\",\",\"&IFERROR(VLOOKUP($J12,【選択肢】!$Q$3:$U$90,5,),\" \")&IF(K12=\"\",\"\",\",\"&IFERROR(VLOOKUP($K12,【選択肢】!$Q$3:$U$90,5,),\" \")&IF(L12=\"\",\"\",\",\"&IFERROR(VLOOKUP($L12,【選択肢】!$Q$3:$U$90,5,),\" \"))))))))","v":""}]
[null,null,null,null,null,0,null,null,null,null,null,null,{"$f":"IF(G13=\"\",\"\",(IFERROR(VLOOKUP($G13,【選択肢】!$Q$3:$U$90,2,),\" \")&IF(H13=\"\",\"\",\",\"&IFERROR(VLOOKUP($H13,【選択肢】!$Q$3:$U$90,2,),\" \")&IF(I13=\"\",\"\",\",\"&IFERROR(VLOOKUP($I13,【選択肢】!$Q$3:$U$90,2,),\" \")&IF(J13=\"\",\"\",\",\"&IFERROR(VLOOKUP($J13,【選択肢】!$Q$3:$U$90,2,),\" \")&IF(K13=\"\",\"\",\",\"&IFERROR(VLOOKUP($K13,【選択肢】!$Q$3:$U$90,2,),\" \")&IF(L13=\"\",\"\",\",\"&IFERROR(VLOOKUP($L13,【選択肢】!$Q$3:$U$90,2,),\" \"))))))))","v":""},{"$f":"IF(G13=\"\",\"\",(IFERROR(VLOOKUP($G13,【選択肢】!$Q$3:$U$90,4,),\" \")&IF(H13=\"\",\"\",\",\"&IFERROR(VLOOKUP($H13,【選択肢】!$Q$3:$U$90,4,),\" \")&IF(I13=\"\",\"\",\",\"&IFERROR(VLOOKUP($I13,【選択肢】!$Q$3:$U$90,4,),\" \")&IF(J13=\"\",\"\",\",\"&IFERROR(VLOOKUP($J13,【選択肢】!$Q$3:$U$90,4,),\" \")&IF(K13=\"\",\"\",\",\"&IFERROR(VLOOKUP($K13,【選択肢】!$Q$3:$U$90,4,),\" \")&IF(L13=\"\",\"\",\",\"&IFERROR(VLOOKUP($L13,【選択肢】!$Q$3:$U$90,4,),\" \"))))))))","v":""},{"$f":"IF(G13=\"\",\"\",(IFERROR(VLOOKUP($G13,【選択肢】!$Q$3:$U$90,5,),\" \")&IF(H13=\"\",\"\",\",\"&IFERROR(VLOOKUP($H13,【選択肢】!$Q$3:$U$90,5,),\" \")&IF(I13=\"\",\"\",\",\"&IFERROR(VLOOKUP($I13,【選択肢】!$Q$3:$U$90,5,),\" \")&IF(J13=\"\",\"\",\",\"&IFERROR(VLOOKUP($J13,【選択肢】!$Q$3:$U$90,5,),\" \")&IF(K13=\"\",\"\",\",\"&IFERROR(VLOOKUP($K13,【選択肢】!$Q$3:$U$90,5,),\" \")&IF(L13=\"\",\"\",\",\"&IFERROR(VLOOKUP($L13,【選択肢】!$Q$3:$U$90,5,),\" \"))))))))","v":""}]
[null,null,null,null,null,0,null,null,null,null,null,null,{"$f":"IF(G14=\"\",\"\",(IFERROR(VLOOKUP($G14,【選択肢】!$Q$3:$U$90,2,),\" \")&IF(H14=\"\",\"\",\",\"&IFERROR(VLOOKUP($H14,【選択肢】!$Q$3:$U$90,2,),\" \")&IF(I14=\"\",\"\",\",\"&IFERROR(VLOOKUP($I14,【選択肢】!$Q$3:$U$90,2,),\" \")&IF(J14=\"\",\"\",\",\"&IFERROR(VLOOKUP($J14,【選択肢】!$Q$3:$U$90,2,),\" \")&IF(K14=\"\",\"\",\",\"&IFERROR(VLOOKUP($K14,【選択肢】!$Q$3:$U$90,2,),\" \")&IF(L14=\"\",\"\",\",\"&IFERROR(VLOOKUP($L14,【選択肢】!$Q$3:$U$90,2,),\" \"))))))))","v":""},{"$f":"IF(G14=\"\",\"\",(IFERROR(VLOOKUP($G14,【選択肢】!$Q$3:$U$90,4,),\" \")&IF(H14=\"\",\"\",\",\"&IFERROR(VLOOKUP($H14,【選択肢】!$Q$3:$U$90,4,),\" \")&IF(I14=\"\",\"\",\",\"&IFERROR(VLOOKUP($I14,【選択肢】!$Q$3:$U$90,4,),\" \")&IF(J14=\"\",\"\",\",\"&IFERROR(VLOOKUP($J14,【選択肢】!$Q$3:$U$90,4,),\" \")&IF(K14=\"\",\"\",\",\"&IFERROR(VLOOKUP($K14,【選択肢】!$Q$3:$U$90,4,),\" \")&IF(L14=\"\",\"\",\",\"&IFERROR(VLOOKUP($L14,【選択肢】!$Q$3:$U$90,4,),\" \"))))))))","v":""},{"$f":"IF(G14=\"\",\"\",(IFERROR(VLOOKUP($G14,【選択肢】!$Q$3:$U$90,5,),\" \")&IF(H14=\"\",\"\",\",\"&IFERROR(VLOOKUP($H14,【選択肢】!$Q$3:$U$90,5,),\" \")&IF(I14=\"\",\"\",\",\"&IFERROR(VLOOKUP($I14,【選択肢】!$Q$3:$U$90,5,),\" \")&IF(J14=\"\",\"\",\",\"&IFERROR(VLOOKUP($J14,【選択肢】!$Q$3:$U$90,5,),\" \")&IF(K14=\"\",\"\",\",\"&IFERROR(VLOOKUP($K14,【選択肢】!$Q$3:$U$90,5,),\" \")&IF(L14=\"\",\"\",\",\"&IFERROR(VLOOKUP($L14,【選択肢】!$Q$3:$U$90,5,),\" \"))))))))","v":""}]
[null,null,null,null,null,0,null,null,null,null,null,null,{"$f":"IF(G15=\"\",\"\",(IFERROR(VLOOKUP($G15,【選択肢】!$Q$3:$U$90,2,),\" \")&IF(H15=\"\",\"\",\",\"&IFERROR(VLOOKUP($H15,【選択肢】!$Q$3:$U$90,2,),\" \")&IF(I15=\"\",\"\",\",\"&IFERROR(VLOOKUP($I15,【選択肢】!$Q$3:$U$90,2,),\" \")&IF(J15=\"\",\"\",\",\"&IFERROR(VLOOKUP($J15,【選択肢】!$Q$3:$U$90,2,),\" \")&IF(K15=\"\",\"\",\",\"&IFERROR(VLOOKUP($K15,【選択肢】!$Q$3:$U$90,2,),\" \")&IF(L15=\"\",\"\",\",\"&IFERROR(VLOOKUP($L15,【選択肢】!$Q$3:$U$90,2,),\" \"))))))))","v":""},{"$f":"IF(G15=\"\",\"\",(IFERROR(VLOOKUP($G15,【選択肢】!$Q$3:$U$90,4,),\" \")&IF(H15=\"\",\"\",\",\"&IFERROR(VLOOKUP($H15,【選択肢】!$Q$3:$U$90,4,),\" \")&IF(I15=\"\",\"\",\",\"&IFERROR(VLOOKUP($I15,【選択肢】!$Q$3:$U$90,4,),\" \")&IF(J15=\"\",\"\",\",\"&IFERROR(VLOOKUP($J15,【選択肢】!$Q$3:$U$90,4,),\" \")&IF(K15=\"\",\"\",\",\"&IFERROR(VLOOKUP($K15,【選択肢】!$Q$3:$U$90,4,),\" \")&IF(L15=\"\",\"\",\",\"&IFERROR(VLOOKUP($L15,【選択肢】!$Q$3:$U$90,4,),\" \"))))))))","v":""},{"$f":"IF(G15=\"\",\"\",(IFERROR(VLOOKUP($G15,【選択肢】!$Q$3:$U$90,5,),\" \")&IF(H15=\"\",\"\",\",\"&IFERROR(VLOOKUP($H15,【選択肢】!$Q$3:$U$90,5,),\" \")&IF(I15=\"\",\"\",\",\"&IFERROR(VLOOKUP($I15,【選択肢】!$Q$3:$U$90,5,),\" \")&IF(J15=\"\",\"\",\",\"&IFERROR(VLOOKUP($J15,【選択肢】!$Q$3:$U$90,5,),\" \")&IF(K15=\"\",\"\",\",\"&IFERROR(VLOOKUP($K15,【選択肢】!$Q$3:$U$90,5,),\" \")&IF(L15=\"\",\"\",\",\"&IFERROR(VLOOKUP($L15,【選択肢】!$Q$3:$U$90,5,),\" \"))))))))","v":""}]
{"$rows_left_out":14}
{"sheet":"【選択肢】","index":1,"n_rows":245,"n_cols":24,"rows_kept":245,"cut":false,"hidden":false,"merged":[[20,23,21,25],[16,2,16,6],[0,0,0,13],[0,16,0,20],[0,21,1,21],[0,22,1,22],[1,18,1,19],[1,5,1,9]]}
[null,null,null,null,null,null,null,null,null,null,null,null,null,null,null,null,"活動記録で選択された取組番号から、区分、項目、取組を自動入力するための表",null,null,null,null,"実施回数のカウント","←活動記録に取組番号が入力された回数をカウントし、これをもとに実施状況報告書の「実施欄」の○、×を判定しています。","都道府県の要綱基本方針において取組を追加した場合の設定方法（県の担当者が作業してください）"]
["A.■か□","B.○か空白","C.○か－か×","D.農村環境保全活動のテーマ","E.高度な保全活動","F.施設（長寿命化）",null,null,null,null,"G.単位","H.構成員一覧の分類","I.金銭出納簿の区分","J.金銭出納簿の収支の分類",null,"プルダウン用","番号","支払区分","活動項目",null,"取組",null,null,"要綱基本方針において取組を追加した場合、以下の方法により修正することができます。"]
["■","○","○","生態系保全","循環かんがいによる水質保全","水路","61　水路の補修","62　水路の更新等",null,null,"km","１.農業者個人",1,"１.前年度持越",null,"○",200,"-","事務処理","事務処理","200 事務処理",null,null,"●共通：活動記録で、追加した取組番号を入力できるようにする"]
["□",null,"－","水質保全","浄化水路による水質保全","農道","63　農道の補修","64　農道の更新等",null,null,"箇所","２.農事組合法人",2,"２.交付金",null,"○",300,"-","会議","会議","300 会議",null,null,"　１）「取組番号早見表シート」及び「取組番号シート」に番号、支払区分、活動項目、取組を追加する。"]
[null,null,"×","景観形成・生活環境保全","地下水かん養","ため池","65　ため池の補修","66　ため池（附帯施設）の更新等",null,null,null,"３.営農組合",null,"３.利子等",null,"○",null,null,null,null,null,null,null,"　２）「選択肢」シートのP列～T列の74行以降に行を挿入し、追加した取組番号、支払区分、活動項目、取組を入力する。"]
[null,null,null,"水田貯留・地下水かん養","持続的な水管理",null,null,null,null,null,null,"４.その他の農業者団体",null,"４.日当",null,"○",1,"農地維持","点検・計画策定","点検","1 点検",{"$f":"COUNTIF(活動記録!$G$8:$L$27,【選択肢】!Q6)","v":0},null,"　３）「選択肢」シートU列の74行以降にU73セル（活動記録に入力された回数のカウントを行う数式）をコピーする。　"]
[null,null,null,"資源循環","土壌流出防止",null,null,null,null,null,null,"５.農業者以外個人",null,"５.外注費",null,"○",2,"農地維持","点検・計画策定","計画策定","2 年度活動計画の策定",{"$f":"COUNTIF(活動記録!$G$8:$L$27,【選択肢】!Q7)","v":0},null,"　　　（この作業により、活動記録に取組番号が入力された回数がＰ列に入力され、これをもとに実施状況報告書の「実施欄」の○、×を判定します。）"]
[null,null,null,null,"生物多様性の回復",null,null,null,null,null,null,"６.自治会",null,"６.その他支出",null,"○",3,"農地維持","研修","研修","3 事務・組織運営等に関する研修、機械の安全使用に関する研修",{"$f":"COUNTIF(活動記録!$G$8:$L$27,【選択肢】!Q8)","v":0}]
[null,null,null,null,"水環境の回復",null,null,null,null,null,null,"７.女性会",null,"７.返還",null,"○",4,"農地維持","実践活動","農用地","4 遊休農地発生防止のための保全管理",{"$f":"COUNTIF(活動記録!$G$8:$L$27,【選択肢】!Q9)","v":0},null,"●農村環境保全活動、多面的機能の増進を図る活動、長寿命化のための活動を追加する場合は以下の設定を行う"]
[null,null,null,null,"持続的な畦畔管理",null,null,null,null,null,null,"８.子供会",null,null,null,"○",5,"農地維持","実践活動","農用地","5 畦畔・法面・防風林の草刈り",{"$f":"COUNTIF(活動記録!$G$8:$L$27,【選択肢】!Q10)","v":0},null,"①農村環境保全活動の項目を追加する場合"]
[null,null,null,null,"専門家の指導",null,null,null,null,null,null,"９.土地改良区",null,null,null,"○",6,"農地維持","実践活動","農用地","6 鳥獣害防護柵等の保守管理",{"$f":"COUNTIF(活動記録!$G$8:$L$27,【選択肢】!Q11)","v":0},null,"活動計画書３（２）１）で実践活動を選択する際に、追加した項目を選択できるようにする"]
[null,null,null,null,null,null,null,null,null,null,null,"10.JA",null,null,null,"○",7,"農地維持","実践活動","水路","7 水路の草刈り",{"$f":"COUNTIF(活動記録!$G$8:$L$27,【選択肢】!Q12)","v":0},null,"　１）「選択肢」シートのV列の「50　地域資源の活用・資源循環活動（資源循環）」の下に取組名を入力する。"]
[null,null,null,null,null,null,null,null,null,null,null,"11.学校・PTA",null,null,null,"○",8,"農地維持","実践活動","水路","8 水路の泥上げ",{"$f":"COUNTIF(活動記録!$G$8:$L$27,【選択肢】!Q13)","v":0},null,"　　　　このとき、「●共通」で入力した取組名と同じになるように注意してください。"]
[null,null,null,null,null,null,null,null,null,null,null,"12.NPO",null,null,null,"○",9,"農地維持","実践活動","水路","9 水路附帯施設の保守管理",{"$f":"COUNTIF(活動記録!$G$8:$L$27,【選択肢】!Q14)","v":0},null,"　２）「数式」タブの「名前の管理」を選択し、リストの中から「K.農村環境保全活動」を選択し、「参照範囲」の右のアイコンをクリック"]
[null,null,null,null,null,null,null,null,null,null,null,"13.その他の農業者以外団体",null,null,null,"○",10,"農地維持","実践活動","農道","10 農道の草刈り",{"$f":"COUNTIF(活動記録!$G$8:$L$27,【選択肢】!Q15)","v":0},null,"　３）参照範囲に追加した取組を含むよう範囲を選択し直し、確定する。"]
{"$rows_left_out":231}
{"sheet":"【取組番号早見表】","index":2,"n_rows":96,"n_cols":4,"rows_kept":96,"cut":false,"hidden":false,"merged":[[70,0,70,1],[73,0,73,1],[88,3,89,3],[90,0,95,0],[90,1,91,1],[92,1,93,1],[94,1,95,1],[88,0,88,1],[88,2,89,2],[74,0,84,1],[53,0,57,0],[51,0,51,1],[51,2,52,2],[58,0,69,0],[58,1,60,1],[61,1,63,1],[67,1,68,1],[64,1,66,1],[38,0,38,1],[39,1,42,1],[45,0,48,0],[51,3,52,3],[39,0,43,0],[44,0,44,1],[10,0,10,1],[0,0,0,3],[26,0,26,1],[27,0,33,1],[7,0,7,1],[11,0,22,0],[11,1,13,1],[14,1,16,1],[17,1,19,1],[20,1,22,1],[8,0,9,0]]}
["取組番号早見表"]
[null,null,null,"取組番号"]
[null,null,"事務処理",200]
[null,null,"会議など",300]
["【農地維持活動】"]
[]
["1．地域資源の基礎的な保全活動"]
["活動項目",null,"取組","取組番号"]
["点検・計画策定","点検","点検",1]
[null,"計画策定","年度活動計画の策定",2]
["研修",null,"事務・組織運営等に関する研修、機械の安全使用に関する研修",3]
["実践活動","農用地","遊休農地発生防止のための保全管理",4]
[null,null,"畦畔・法面・防風林の草刈り",5]
[null,null,"鳥獣害防護柵等の保守管理",6]
[null,"水路","水路の草刈り",7]
{"$rows_left_out":82}
{"sheet":"【活動項目番号表】 ","index":3,"n_rows":189,"n_cols":6,"rows_kept":189,"cut":false,"hidden":false,"merged":[[160,5,161,5],[162,0,185,0],[162,1,185,1],[162,2,172,2],[162,3,168,3],[162,4,168,4],[169,3,172,3],[169,4,172,4],[173,2,178,2],[173,3,175,3],[146,0,156,0],[146,1,156,2],[173,4,175,4],[176,3,178,3],[176,4,178,4],[179,2,185,2],[179,3,183,3],[179,4,183,4],[184,3,185,3],[184,4,185,4],[160,4,161,4],[160,0,161,0],[160,1,160,2],[160,3,161,3],[119,3,121,3],[119,4,121,4],[68,2,83,2],[102,0,103,0],[102,1,102,2],[102,3,103,3],[102,4,103,4],[127,4,128,4],[130,3,132,3],[130,4,132,4],[108,2,109,2],[145,1,145,2],[102,5,103,5],[104,0,142,0],[104,1,110,1],[105,2,106,2],[105,3,106,3],[105,4,106,4],[122,3,126,3],[122,4,126,4],[127,2,132,2],[127,3,128,3],[108,3,109,3],[108,4,109,4],[111,2,117,2],[113,3,117,3],[113,4,117,4],[133,2,135,2],[134,3,135,3],[134,4,135,4],[137,1,142,2],[137,3,142,3],[137,4,142,4],[111,1,136,1],[118,2,126,2],[53,4,54,4],[37,1,37,2],[68,3,83,3],[68,4,83,4],[84,3,91,3],[84,4,91,4],[92,3,99,3],[92,4,99,4],[55,3,56,3],[55,4,56,4],[58,1,60,2],[58,3,60,3],[58,4,60,4],[61,1,99,1],[61,2,67,2],[61,3,67,3],[49,1,57,1],[49,2,56,2],[84,2,91,2],[92,2,99,2],[61,4,67,4],[0,0,0,5],[7,1,7,2],[8,0,34,0],[8,1,10,1],[8,2,9,2],[8,3,9,3],[8,4,9,4],[11,1,11,2],[12,1,34,1],[17,4,18,4],[19,3,20,3],[19,4,20,4],[21,3,23,3],[38,0,44,0],[38,1,44,2],[48,1,48,2],[49,0,99,0],[33,2,34,2],[33,3,34,3],[33,4,34,4],[13,3,14,3],[13,4,14,4],[15,3,16,3],[15,4,16,4],[17,2,23,2],[17,3,18,3],[12,2,16,2],[21,4,23,4],[24,2,26,2],[27,2,32,2],[29,3,32,3],[29,4,32,4],[49,3,50,3],[49,4,50,4],[51,3,52,3],[51,4,52,4],[53,3,54,3]]}
["活動項目番号表"]
[]
[null,null,null,null,"活動項目番号"]
[null,null,null,"事務処理",200]
[null,null,null,"会議など",300]
["【農地維持活動】"]
["（地域資源の基礎的な保全活動）"]
["支払区分","活動区分",null,"活動項目","活動項目番号","取組の内容（平成30年度までの取組名）"]
["１（農地維持）","点検・\n計画\n策定","点検","点検",1,"遊休農地等の発生状況の把握"]
[null,null,null,null,null,"施設の点検（水路、農道、ため池）"]
[null,null,"計画策定","年度活動計画の策定",2,"年度活動計画の策定"]
[null,"研修",null,"事務・組織運営等に関する研修、\n機械の安全使用に関する研修",3,"活動に関する事務（書類作成、申請手続き等）や組織の運営に関する研修"]
[null,"実践活動","農用地","遊休農地発生防止の\nための保全管理",4,"遊休農地発生防止のための保全管理"]
[null,null,null,"畦畔・法面・防風林の\n草刈り",5,"畦畔・農用地法面等の草刈り"]
[null,null,null,null,null,"防風林の枝払い・下草の草刈り"]
{"$rows_left_out":174}